BDBM50159752 CHEMBL3786824
SMILES N[C@@H](Cc1c(O)noc1-c1nnn(Cc2ccncc2)n1)C(O)=O
InChI Key InChIKey=BOAFSTDNNFYOKT-VIFPVBQESA-N
Data  6 KI
  Tab Delimited (TSV)   2D SDfile   Computed 3D by Vconf -m prep SDfile
Find this compound or compounds like it in BindingDB:
Activity Spreadsheet -- Enzyme Inhibition Constant Data from BindingDB
Found 6 hits for monomerid = 50159752
TargetGlutamate receptor 3(RAT)
University Of Copenhagen
Curated by ChEMBL
LigandPNGBDBM50159752(CHEMBL3786824)
Affinity DataKi:  1.91E+4nM. Assay description: Displacement of [3H]AMPA from recombinant rat GluA3 receptor flop isoform expressed in sf9 insect cells
In DepthDetails ArticlePubMed
TargetGlutamate receptor 4(Rattus norvegicus)
University Of Copenhagen
Curated by ChEMBL
LigandPNGBDBM50159752(CHEMBL3786824)
Affinity DataKi:  5.56E+4nM. Assay description: Displacement of [3H]AMPA from recombinant rat GluA4 receptor flop isoform expressed in sf9 insect cells
In DepthDetails ArticlePubMed
TargetGlutamate receptor 2(Rattus norvegicus)
University Of Copenhagen
Curated by ChEMBL
LigandPNGBDBM50159752(CHEMBL3786824)
Affinity DataKi: >1.00E+5nM. Assay description: Displacement of [3H]AMPA from recombinant rat GluA2 receptor flop isoform expressed in sf9 insect cells
In DepthDetails ArticlePubMed
TargetGlutamate receptor ionotropic, kainate 3(Rattus norvegicus)
University Of Copenhagen
Curated by ChEMBL
LigandPNGBDBM50159752(CHEMBL3786824)
Affinity DataKi: >1.00E+5nM. Assay description: Displacement of [3H]KA from recombinant rat GluK3 receptor expressed in sf9 insect cells
In DepthDetails ArticlePubMed
TargetGlutamate receptor ionotropic, kainate 2(Rattus norvegicus)
University Of Copenhagen
Curated by ChEMBL
LigandPNGBDBM50159752(CHEMBL3786824)
Affinity DataKi: >1.00E+5nM. Assay description: Displacement of [3H]KA from recombinant rat GluK2(V,C,R) receptor expressed in sf9 insect cells
In DepthDetails ArticlePubMed
TargetGlutamate receptor 1(Rattus norvegicus (Rat))
University Of Copenhagen
Curated by ChEMBL
LigandPNGBDBM50159752(CHEMBL3786824)
Affinity DataKi: >1.00E+5nM. Assay description: Displacement of [3H]AMPA from recombinant rat GluA1 receptor flop isoform expressed in sf9 insect cells
In DepthDetails ArticlePubMed