BDBM50159753 14-[2-benzyl(methyl)aminoethyl]-16-methyl-6,14-diazatetracyclo[7.5.3.01,10.02,7]heptadeca-2(7),3,16-trien-5-one::CHEMBL361866
SMILES CN(CCN1CCC[C@@H]2[C@@H]3Cc4[nH]c(=O)ccc4[C@]12CC(C)=C3)Cc1ccccc1
InChI Key InChIKey=ABFFFWWNVUNIQI-VVZHRXSXSA-N
Data  1 IC50
  Tab Delimited (TSV)   2D SDfile   Computed 3D by Vconf -m prep SDfile
Find this compound or compounds like it in BindingDB:
Activity Spreadsheet -- Enzyme Inhibition Constant Data from BindingDB
Found 1 hit for monomerid = 50159753
TargetAcetylcholinesterase(Rattus norvegicus (rat))
Chinese Academy Of Sciences
Curated by ChEMBL
LigandPNGBDBM50159753(14-[2-benzyl(methyl)aminoethyl]-16-methyl-6,14-dia...)
Affinity DataIC50:  6.65E+4nM. Assay description: Inhibitory concentration against acetylcholinesterase from rat cortex homogenate by ellman method was determined
In DepthDetails ArticlePubMed