BDBM50160258 CHEMBL3787268
SMILES CCCCCCCNC(=O)Oc1ccc2N(C)C(N(C)Cc2c1)c1ccc(cc1)C(F)(F)F
InChI Key InChIKey=KFCJVSBXRUAKCE-UHFFFAOYSA-N
Data  1 IC50
  Tab Delimited (TSV)   2D SDfile   Computed 3D by Vconf -m prep SDfile
Find this compound or compounds like it in BindingDB:
Activity Spreadsheet -- Enzyme Inhibition Constant Data from BindingDB
Found 1 hit for monomerid = 50160258
TargetCholinesterase(Equus caballus (Horse))
Universit£T W£Rzburg
Curated by ChEMBL
LigandPNGBDBM50160258(CHEMBL3787268)
Affinity DataIC50:  2.70E+3nM. Assay description: Inhibition of equine serum butyrylcholinesterase using butyrylcholine iodide as substrate preincubated for 30 mins followed by substrate addition mea...
In DepthDetails ArticlePubMed