BDBM50160287 CHEMBL3787453
SMILES Fc1ccc(cc1)[C@H]1CN([C@@H]1c1ccc2OCOc2c1)C1CCN(CC1)C(=O)n1cncn1
InChI Key InChIKey=IWSLFABPEBZJJD-NFBKMPQASA-N
Data  1 IC50
  Tab Delimited (TSV)   2D SDfile   Computed 3D by Vconf -m prep SDfile
Find this compound or compounds like it in BindingDB:
Activity Spreadsheet -- Enzyme Inhibition Constant Data from BindingDB
Found 1 hit for monomerid = 50160287
TargetMonoglyceride lipase(Homo sapiens (Human))
University Of Siena
Curated by ChEMBL
LigandPNGBDBM50160287(CHEMBL3787453)
Affinity DataIC50:  376nM. Assay description: Inhibition of recombinant C-terminal His6-tagged human MAGL expressed in Escherichia coli using 2-arachidonoyl-[3H]-glycerol as substrate incubated f...
In DepthDetails ArticlePubMed