BDBM50160329 CHEMBL3787163
SMILES CCCN(CCC)CC(=O)N1N=C(C)CC1c1cc(Br)ccc1O
InChI Key InChIKey=RORXMRKXCOSALE-UHFFFAOYSA-N
Data  1 IC50
  Tab Delimited (TSV)   2D SDfile   Computed 3D by Vconf -m prep SDfile
Find this compound or compounds like it in BindingDB:
Activity Spreadsheet -- Enzyme Inhibition Constant Data from BindingDB
Found 1 hit for monomerid = 50160329
TargetTelomerase reverse transcriptase(Homo sapiens (Human))
Anhui Medical University
Curated by ChEMBL
LigandPNGBDBM50160329(CHEMBL3787163)
Affinity DataIC50:  9.94E+3nM. Assay description: Inhibition of telomerase in human MGC-803 cells after 24 hrs by TRAP-PCR-ELISA assay
In DepthDetails ArticlePubMed