BDBM50160382 CHEMBL3787238
SMILES CC1=NN(C(C1)c1ccccc1O)C(=O)COc1ccc(Cl)cc1
InChI Key InChIKey=UXYHDQHEVOBOJH-UHFFFAOYSA-N
Data  1 IC50
  Tab Delimited (TSV)   2D SDfile   Computed 3D by Vconf -m prep SDfile
Find this compound or compounds like it in BindingDB:
Activity Spreadsheet -- Enzyme Inhibition Constant Data from BindingDB
Found 1 hit for monomerid = 50160382
TargetTelomerase reverse transcriptase(Homo sapiens (Human))
Anhui Medical University
Curated by ChEMBL
LigandPNGBDBM50160382(CHEMBL3787238)
Affinity DataIC50:  5.44E+4nM. Assay description: Inhibition of telomerase in human MGC-803 cells after 24 hrs by TRAP-PCR-ELISA assay
In DepthDetails ArticlePubMed