BDBM50160696 CHEMBL3785555
SMILES COc1ccc2C(N(Cc3ccccc3-c3ccccc3)C(=O)c2c1)C(=O)NC(C)(C)C
InChI Key InChIKey=JKXBNSIIDORWAP-NRFANRHFSA-N
Data  2 IC50
  Tab Delimited (TSV)   2D SDfile   Computed 3D by Vconf -m prep SDfile
Find this compound or compounds like it in BindingDB:
Activity Spreadsheet -- Enzyme Inhibition Constant Data from BindingDB
Found 2 hits for monomerid = 50160696
TargetPotassium voltage-gated channel subfamily A member 5(Homo sapiens (Human))
Astrazeneca
Curated by ChEMBL
LigandPNGBDBM50160696(CHEMBL3785555)
Affinity DataIC50:  1.13E+4nM. Assay description: Inhibition of human Kv1.5 channel by Rb-flux assay
In DepthDetails ArticlePubMed
TargetPotassium voltage-gated channel subfamily H member 2(Homo sapiens (Human))
Astrazeneca
Curated by ChEMBL
LigandPNGBDBM50160696(CHEMBL3785555)
Affinity DataIC50:  3.00E+4nM. Assay description: Inhibition of human ERG
In DepthDetails ArticlePubMed