BDBM50160708 CHEMBL3786775
SMILES Cc1c2C(=O)N(Cc3ccccc3-c3ccc(F)cc3)C(C(=O)NC(C)(C)C)c2ccc1O
InChI Key InChIKey=ADISMBDGXHSLNK-UHFFFAOYSA-N
Data  2 IC50
  Tab Delimited (TSV)   2D SDfile   Computed 3D by Vconf -m prep SDfile
Find this compound or compounds like it in BindingDB:
Activity Spreadsheet -- Enzyme Inhibition Constant Data from BindingDB
Found 2 hits for monomerid = 50160708
TargetPotassium voltage-gated channel subfamily H member 2(Homo sapiens (Human))
Astrazeneca
Curated by ChEMBL
LigandPNGBDBM50160708(CHEMBL3786775)
Affinity DataIC50: >3.20E+4nM. Assay description: Inhibition of human ERG
In DepthDetails ArticlePubMed
TargetPotassium voltage-gated channel subfamily A member 5(Homo sapiens (Human))
Astrazeneca
Curated by ChEMBL
LigandPNGBDBM50160708(CHEMBL3786775)
Affinity DataIC50:  2.70E+3nM. Assay description: Inhibition of human Kv1.5 channel by QPatch-clamp method
In DepthDetails ArticlePubMed