BDBM50160724 3-[Methyl-(4''-trifluoromethyl-biphenyl-4-carbonyl)-amino]-pyrrolidine-1-carboxylic acid methyl-[1-(tetrahydro-pyran-4-yl)-pyrrolidin-3-yl]-amide::CHEMBL436081
SMILES CN(C1CCN(C1)C1CCOCC1)C(=O)N1CCC(C1)N(C)C(=O)c1ccc(cc1)-c1ccc(cc1)C(F)(F)F
InChI Key InChIKey=LDJHHVNOOGLYRV-UHFFFAOYSA-N
Data  1 KI
  Tab Delimited (TSV)   2D SDfile   Computed 3D by Vconf -m prep SDfile
Find this compound or compounds like it in BindingDB:
Activity Spreadsheet -- Enzyme Inhibition Constant Data from BindingDB
Found 1 hit for monomerid = 50160724
TargetMelanin-concentrating hormone receptor 1(Homo sapiens (Human))
Neurocrine Biosciences
Curated by ChEMBL
LigandPNGBDBM50160724(3-[Methyl-(4''-trifluoromethyl-biphenyl-4-carbonyl...)
Affinity DataKi:  75nM. Assay description: Displacement of [125I]MCH from human Melanin-concentrating hormone 1 (MCH1) receptor modified for optimal expression in HEK293 cells
In DepthDetails ArticlePubMed