BDBM50160886 CHEMBL3794442
SMILES COc1ccc(cc1OC)C(C)(C)c1cnc(SCCOc2ccc(cc2)-n2ccnc2C)n1-c1ccc(F)cc1
InChI Key InChIKey=GQNFXODOTWEOTN-UHFFFAOYSA-N
Data  1 EC50
  Tab Delimited (TSV)   2D SDfile   Computed 3D by Vconf -m prep SDfile
Find this compound or compounds like it in BindingDB:
Activity Spreadsheet -- Enzyme Inhibition Constant Data from BindingDB
Found 1 hit for monomerid = 50160886
TargetG-protein coupled bile acid receptor 1(Homo sapiens (Human))
Zydus Research Centre
Curated by ChEMBL
LigandPNGBDBM50160886(CHEMBL3794442)
Affinity DataEC50:  1.5nM. Assay description: Agonist activity at human TGR5 expressed in CHO-K1 cells after 5 hrs by luciferase reporter gene assay
In DepthDetails ArticlePubMed