BDBM50161016 6-Chloro-3-methylamino-pyrazine-2-carboxylic acid pyridin-2-ylamide::CHEMBL179387
SMILES CNc1ncc(Cl)nc1C(=O)Nc1ccccn1
InChI Key InChIKey=TXIAGDTYGRTGNY-UHFFFAOYSA-N
Data  1 IC50
  Tab Delimited (TSV)   2D SDfile   Computed 3D by Vconf -m prep SDfile
Find this compound or compounds like it in BindingDB:
Activity Spreadsheet -- Enzyme Inhibition Constant Data from BindingDB
Found 1 hit for monomerid = 50161016
TargetMetabotropic glutamate receptor 5(Homo sapiens (Human))
Merck Research Laboratories
Curated by ChEMBL
LigandPNGBDBM50161016(6-Chloro-3-methylamino-pyrazine-2-carboxylic acid ...)
Affinity DataIC50:  145nM. Assay description: Inhibitory concentration against human recombinant metabotropic glutamate receptor 5 (mGlu5) in Ltk cells determined using fluorescence detection met...
In DepthDetails ArticlePubMed