BDBM50161103 CHEMBL3792473
SMILES Cc1cc(ccc1-c1ccc(cc1)N(CC(F)(F)F)S(=O)(=O)c1cccc(Cl)c1)C1(CC1)C(O)=O
InChI Key InChIKey=ABOKITDWIKCJJP-UHFFFAOYSA-N
Data  1 IC50
  Tab Delimited (TSV)   2D SDfile   Computed 3D by Vconf -m prep SDfile
Find this compound or compounds like it in BindingDB:
Activity Spreadsheet -- Enzyme Inhibition Constant Data from BindingDB
Found 1 hit for monomerid = 50161103
TargetNuclear receptor ROR-gamma(Homo sapiens (Human))
Biogen
Curated by ChEMBL
LigandPNGBDBM50161103(CHEMBL3792473)
Affinity DataIC50: >1.00E+4nM. Assay description: Inverse agonist activity at recombinant human GST-tagged ROR-gamma receptor ligand binding domain assessed as inhibition of receptor and co-activator...
In DepthDetails ArticlePubMed