BDBM50161206 CHEMBL3785925
SMILES O=C(CSc1nc2sccc2c(=O)n1C1CC1)c1ccccc1
InChI Key InChIKey=QVXAEEGEUNULNF-UHFFFAOYSA-N
Data  1 IC50
  Tab Delimited (TSV)   2D SDfile   Computed 3D by Vconf -m prep SDfile
Find this compound or compounds like it in BindingDB:
Activity Spreadsheet -- Enzyme Inhibition Constant Data from BindingDB
Found 1 hit for monomerid = 50161206
TargetcAMP-specific 3',5'-cyclic phosphodiesterase 4D(Homo sapiens (Human))
Vanderbilt University School Of Medicine
Curated by ChEMBL
LigandPNGBDBM50161206(CHEMBL3785925)
Affinity DataIC50:  3.10E+3nM. Assay description: Inhibition of PDE4D (unknown origin) preincubated for 5 mins followed by cAMP addition measured after 15 mins by PDE-Glo phosphodiesterase assay
In DepthDetails ArticlePubMed