BDBM50161282 CHEMBL3787505
SMILES COc1cc(F)c(cc1-c1ccc(cc1CN1[C@H](C)[C@@H](OC1=O)c1cc(cc(c1)C(F)(F)F)C(F)(F)F)C(F)(F)F)C(C)C
InChI Key InChIKey=MZZLGJHLQGUVPN-PVPMGCCUSA-N
Data  1 IC50
  Tab Delimited (TSV)   2D SDfile   Computed 3D by Vconf -m prep SDfile
Find this compound or compounds like it in BindingDB:
Activity Spreadsheet -- Enzyme Inhibition Constant Data from BindingDB
Found 1 hit for monomerid = 50161282
TargetCholesteryl ester transfer protein(Homo sapiens (Human))
Shenyang Pharmaceutical University
Curated by ChEMBL
LigandPNGBDBM50161282(CHEMBL3787505)
Affinity DataIC50:  60nM. Assay description: Inhibition of full-length human recombinant CETP expressed in CHO cells by BODIPY-CE fluorescence assay
In DepthDetails ArticlePubMed