BDBM50161306 (3-Aminooxalyl-1-benzyl-2-ethyl-1,2,3,6,7,8-hexahydro-1-aza-as-indacen-4-yloxy)-acetic acid methyl ester::CHEMBL179309
SMILES CCc1c(C(=O)C(N)=O)c2c(OCC(=O)OC)cc3CCCc3c2n1Cc1ccccc1
InChI Key InChIKey=LBZKCAJYHMFIHZ-UHFFFAOYSA-N
Data  1 IC50
  Tab Delimited (TSV)   2D SDfile   Computed 3D by Vconf -m prep SDfile
Find this compound or compounds like it in BindingDB:
Activity Spreadsheet -- Enzyme Inhibition Constant Data from BindingDB
Found 1 hit for monomerid = 50161306
TargetPhospholipase A2, membrane associated(Homo sapiens (Human))
Eli Lilly
Curated by ChEMBL
LigandPNGBDBM50161306((3-Aminooxalyl-1-benzyl-2-ethyl-1,2,3,6,7,8-hexahy...)
Affinity DataIC50:  108nM. Assay description: Inhibitory concentration against human nonpancreatic secretory phospholipase A2
In DepthDetails ArticlePubMed