BDBM50161651 4-(1H-IMIDAZOL-4-YL)-3-(5-ETHYL-2,4-DIHYDROXY-PHENYL)-1H-PYRAZOLE::4-(4-(1H-imidazol-4-yl)-1H-pyrazol-3-yl)-6-ethylbenzene-1,3-diol::4-Ethyl-6-[4-(1H-imidazol-4-yl)-1H-pyrazol-3-yl]-benzene-1,3-diol::CHEMBL360563
SMILES CCc1cc(-c2n[nH]cc2-c2c[nH]cn2)c(O)cc1O
InChI Key InChIKey=ATORUNMAUREKMH-UHFFFAOYSA-N
Data  2 Kd
PDB links: 1 PDB ID matches this monomer.
  Tab Delimited (TSV)   2D SDfile   Computed 3D by Vconf -m prep SDfile
Find this compound or compounds like it in BindingDB:
Activity Spreadsheet -- Enzyme Inhibition Constant Data from BindingDB
Found 2 hits for monomerid = 50161651
TargetHeat shock protein HSP 90-beta(Homo sapiens (Human))
Memorial Sloan-Kettering Cancer Center
Curated by ChEMBL
LigandPNGBDBM50161651(4-(1H-IMIDAZOL-4-YL)-3-(5-ETHYL-2,4-DIHYDROXY-PHEN...)
Affinity DataKd:  280nM. Assay description: Inhibition of Hsp90 by surface plasmon resonance assay
TargetHeat shock protein HSP 90-alpha(Homo sapiens (Human))
Genomics Institute Of The Novartis Research Foundation
Curated by ChEMBL
LigandPNGBDBM50161651(4-(1H-IMIDAZOL-4-YL)-3-(5-ETHYL-2,4-DIHYDROXY-PHEN...)
Affinity DataKd:  280nM. Assay description: In vitro dissociation constant for heat shock 90 kDa protein alpha