BDBM50161787 CHEMBL178770::o-Tolyl-carbamic acid 3a-methyl-2,3,3a,8a-tetrahydro-benzo[b]furo[3,2-d]furan-5-yl ester
SMILES Cc1ccccc1NC(=O)Oc1ccc2OC3OCCC3(C)c2c1
InChI Key InChIKey=JZMKNXICJRCGJX-UHFFFAOYSA-N
Data  2 IC50
  Tab Delimited (TSV)   2D SDfile   Computed 3D by Vconf -m prep SDfile
Find this compound or compounds like it in BindingDB:
Activity Spreadsheet -- Enzyme Inhibition Constant Data from BindingDB
Found 2 hits for monomerid = 50161787
TargetCholinesterase(Homo sapiens (Human))
National Institute On Aging
Curated by ChEMBL
LigandPNGBDBM50161787(CHEMBL178770 | o-Tolyl-carbamic acid 3a-methyl-2,3...)
Affinity DataIC50: >3.00E+4nM. Assay description: Inhibitory concentration against human plasma Butyrylcholinesterase
In DepthDetails ArticlePubMed
TargetAcetylcholinesterase(Homo sapiens (Human))
National Institute On Aging
Curated by ChEMBL
LigandPNGBDBM50161787(CHEMBL178770 | o-Tolyl-carbamic acid 3a-methyl-2,3...)
Affinity DataIC50:  23nM. Assay description: Inhibitory concentration against human erythrocyte Acetylcholinesterase
In DepthDetails ArticlePubMed