BDBM50161789 CHEMBL369554::Ethyl-carbamic acid 3a-methyl-2,3,3a,8a-tetrahydro-benzo[b]furo[3,2-d]furan-5-yl ester
SMILES CCNC(=O)Oc1ccc2OC3OCCC3(C)c2c1
InChI Key InChIKey=ZEZHVLKHFYAVTB-UHFFFAOYSA-N
Data  2 IC50
  Tab Delimited (TSV)   2D SDfile   Computed 3D by Vconf -m prep SDfile
Find this compound or compounds like it in BindingDB:
Activity Spreadsheet -- Enzyme Inhibition Constant Data from BindingDB
Found 2 hits for monomerid = 50161789
TargetAcetylcholinesterase(Homo sapiens (Human))
National Institute On Aging
Curated by ChEMBL
LigandPNGBDBM50161789(CHEMBL369554 | Ethyl-carbamic acid 3a-methyl-2,3,3...)
Affinity DataIC50:  360nM. Assay description: Inhibitory concentration against human erythrocyte Acetylcholinesterase
In DepthDetails ArticlePubMed
TargetCholinesterase(Homo sapiens (Human))
National Institute On Aging
Curated by ChEMBL
LigandPNGBDBM50161789(CHEMBL369554 | Ethyl-carbamic acid 3a-methyl-2,3,3...)
Affinity DataIC50:  6nM. Assay description: Inhibitory concentration against human plasma Butyrylcholinesterase
In DepthDetails ArticlePubMed