BDBM50161920 CHEMBL367792::N-[4-(4-Benzyloxy-3-chloro-phenylamino)-3-cyano-7-ethoxy-quinolin-6-yl]-3-quinolin-8-yl-acrylamide
SMILES CCOc1cc2ncc(C#N)c(Nc3ccc(OCc4ccccc4)c(Cl)c3)c2cc1NC(=O)\C=C\c1cccc2cccnc12
InChI Key InChIKey=VJBGCGWDTBHXQK-DTQAZKPQSA-N
Data  2 IC50
  Tab Delimited (TSV)   2D SDfile   Computed 3D by Vconf -m prep SDfile
Find this compound or compounds like it in BindingDB:
Activity Spreadsheet -- Enzyme Inhibition Constant Data from BindingDB
Found 2 hits for monomerid = 50161920
TargetReceptor tyrosine-protein kinase erbB-2(Homo sapiens (Human))
Wyeth Research
Curated by ChEMBL
LigandPNGBDBM50161920(CHEMBL367792 | N-[4-(4-Benzyloxy-3-chloro-phenylam...)
Affinity DataIC50:  1.13E+3nM. Assay description: Inhibition of human epidermal growth factor receptor-2 (HER-2) autophosphorylation
In DepthDetails ArticlePubMed
TargetEpidermal growth factor receptor(Homo sapiens (Human))
Wyeth Research
Curated by ChEMBL
LigandPNGBDBM50161920(CHEMBL367792 | N-[4-(4-Benzyloxy-3-chloro-phenylam...)
Affinity DataIC50:  990nM. Assay description: Inhibition of human epidermal growth factor receptor (EGFR) autophosphorylation
In DepthDetails ArticlePubMed