BDBM50161924 4-Dimethylamino-but-2-enoic acid {4-[4-(benzothiazol-2-ylmethoxy)-3-chloro-phenylamino]-3-cyano-7-ethoxy-quinolin-6-yl}-amide::CHEMBL175513
SMILES CCOc1cc2ncc(C#N)c(Nc3ccc(OCc4nc5ccccc5s4)c(Cl)c3)c2cc1NC(=O)\C=C\CN(C)C
InChI Key InChIKey=AAAAZQPHATYWOK-JXMROGBWSA-N
Data  2 IC50
  Tab Delimited (TSV)   2D SDfile   Computed 3D by Vconf -m prep SDfile
Find this compound or compounds like it in BindingDB:
Activity Spreadsheet -- Enzyme Inhibition Constant Data from BindingDB
Found 2 hits for monomerid = 50161924
TargetEpidermal growth factor receptor(Homo sapiens (Human))
Wyeth Research
Curated by ChEMBL
LigandPNGBDBM50161924(4-Dimethylamino-but-2-enoic acid {4-[4-(benzothiaz...)
Affinity DataIC50:  188nM. Assay description: Inhibition of human epidermal growth factor receptor (EGFR) autophosphorylation
In DepthDetails ArticlePubMed
TargetReceptor tyrosine-protein kinase erbB-2(Homo sapiens (Human))
Wyeth Research
Curated by ChEMBL
LigandPNGBDBM50161924(4-Dimethylamino-but-2-enoic acid {4-[4-(benzothiaz...)
Affinity DataIC50:  64nM. Assay description: Inhibition of human epidermal growth factor receptor-2 (HER-2) autophosphorylation
In DepthDetails ArticlePubMed