BDBM50162291 CHEMBL3794161
SMILES COc1ccc2c(c1)occ(Cn1ccnc1)c2=O
InChI Key InChIKey=ZDCWVUORJCJNGQ-UHFFFAOYSA-N
Data  2 IC50
  Tab Delimited (TSV)   2D SDfile   Computed 3D by Vconf -m prep SDfile
Find this compound or compounds like it in BindingDB:
Activity Spreadsheet -- Enzyme Inhibition Constant Data from BindingDB
Found 2 hits for monomerid = 50162291
TargetCytochrome P450 11B2, mitochondrial(Homo sapiens (Human))
University Of Bologna
Curated by ChEMBL
LigandPNGBDBM50162291(CHEMBL3794161)
Affinity DataIC50:  768nM. Assay description: Inhibition of human CYP11B2 expressed in V79 MZh cells using [1,2-3H]-11-deoxycorticosterone as substrate for 30 mins by HPTLC analysis
In DepthDetails ArticlePubMed
TargetCytochrome P450 11B1, mitochondrial(Homo sapiens (Human))
University Of Bologna
Curated by ChEMBL
LigandPNGBDBM50162291(CHEMBL3794161)
Affinity DataIC50:  372nM. Assay description: Inhibition of human CYP11B1 expressed in V79 MZh cells using [1,2-3H]-11-deoxycorticosterone as substrate for 6 hrs by HPTLC analysis
In DepthDetails ArticlePubMed