BDBM50162572 6,7-Dichloro-2-cyclopentyl-5-[3-(pyridin-4-ylsulfanylmethyl)-benzyloxy]-indan-1-one::CHEMBL179839
SMILES Clc1c2C(=O)C(Cc2cc(OCc2cccc(CSc3ccncc3)c2)c1Cl)C1CCCC1
InChI Key InChIKey=XMYHKZONDUFBIM-UHFFFAOYSA-N
Data  1 EC50
  Tab Delimited (TSV)   2D SDfile   Computed 3D by Vconf -m prep SDfile
Find this compound or compounds like it in BindingDB:
Activity Spreadsheet -- Enzyme Inhibition Constant Data from BindingDB
Found 1 hit for monomerid = 50162572
TargetMetabotropic glutamate receptor 2(Homo sapiens (Human))
Merck Research Laboratories
Curated by ChEMBL
LigandPNGBDBM50162572(6,7-Dichloro-2-cyclopentyl-5-[3-(pyridin-4-ylsulfa...)
Affinity DataEC50:  165nM. Assay description: Binding affinity against metabotropic glutamate receptor 2
In DepthDetails ArticlePubMed