BDBM50162828 1-(1-(3-(3-(3,4-dichlorophenyl)-5-(methylsulfonyl)-4,5,6,7-tetrahydropyrazolo[4,3-c]pyridin-1-yl)propyl)piperidin-4-yl)-3-methyl-1H-benzo[d]imidazol-2(3H)-one::1-(1-{3-[3-(3,4-Dichloro-phenyl)-5-methanesulfonyl-4,5,6,7-tetrahydro-pyrazolo[4,3-c]pyridin-1-yl]-propyl}-piperidin-4-yl)-3-methyl-1,3-dihydro-benzoimidazol-2-one::CHEMBL180108
SMILES Cn1c2ccccc2n(C2CCN(CCCn3nc(c4CN(CCc34)S(C)(=O)=O)-c3ccc(Cl)c(Cl)c3)CC2)c1=O
InChI Key InChIKey=YQQYXWVMTOUJTM-UHFFFAOYSA-N
Data  3 IC50
  Tab Delimited (TSV)   2D SDfile   Computed 3D by Vconf -m prep SDfile
Find this compound or compounds like it in BindingDB:
Activity Spreadsheet -- Enzyme Inhibition Constant Data from BindingDB
Found 3 hits for monomerid = 50162828
TargetCathepsin S(Homo sapiens (Human))
Johnson And Johnson Pharmaceutical Research And Development
Curated by ChEMBL
LigandPNGBDBM50162828(1-(1-(3-(3-(3,4-dichlorophenyl)-5-(methylsulfonyl)...)
Affinity DataIC50:  50nM. Assay description: Inhibitory concentration against cathepsin S
In DepthDetails ArticlePubMed
TargetCathepsin S(Homo sapiens (Human))
Johnson And Johnson Pharmaceutical Research And Development
Curated by ChEMBL
LigandPNGBDBM50162828(1-(1-(3-(3-(3,4-dichlorophenyl)-5-(methylsulfonyl)...)
Affinity DataIC50:  800nM. Assay description: Inhibition of cathepsin S in human JY cells by invariant chain degradation assay
In DepthDetails ArticlePubMed
TargetCathepsin S(Homo sapiens (Human))
Johnson And Johnson Pharmaceutical Research And Development
Curated by ChEMBL
LigandPNGBDBM50162828(1-(1-(3-(3-(3,4-dichlorophenyl)-5-(methylsulfonyl)...)
Affinity DataIC50:  10nM. Assay description: Inhibition of human cathepsin S
In DepthDetails ArticlePubMed