BDBM50162841 1-(1-{(S)-3-[5-Acetyl-3-(4-trifluoromethyl-phenyl)-4,5,6,7-tetrahydro-pyrazolo[4,3-c]pyridin-1-yl]-2-hydroxy-propyl}-piperidin-4-yl)-6-chloro-1,3-dihydro-benzoimidazol-2-one::CHEMBL179835
SMILES CC(=O)N1CCc2c(C1)c(nn2C[C@@H](O)CN1CCC(CC1)n1c2cc(Cl)ccc2[nH]c1=O)-c1ccc(cc1)C(F)(F)F
InChI Key InChIKey=OXTVZNSEMSDNET-QHCPKHFHSA-N
Data  1 IC50
  Tab Delimited (TSV)   2D SDfile   Computed 3D by Vconf -m prep SDfile
Find this compound or compounds like it in BindingDB:
Activity Spreadsheet -- Enzyme Inhibition Constant Data from BindingDB
Found 1 hit for monomerid = 50162841
TargetCathepsin S(Homo sapiens (Human))
Johnson And Johnson Pharmaceutical Research And Development
Curated by ChEMBL
LigandPNGBDBM50162841(1-(1-{(S)-3-[5-Acetyl-3-(4-trifluoromethyl-phenyl)...)
Affinity DataIC50:  200nM. Assay description: Inhibitory concentration against cathepsin S
In DepthDetails ArticlePubMed