BDBM50162857 1-(1-{3-[3-(4-Bromo-phenyl)-5-methanesulfonyl-4,5,6,7-tetrahydro-pyrazolo[4,3-c]pyridin-1-yl]-propyl}-piperidin-4-yl)-1,3-dihydro-benzoimidazol-2-one::CHEMBL180876
SMILES CS(=O)(=O)N1CCc2c(C1)c(nn2CCCN1CCC(CC1)n1c2ccccc2[nH]c1=O)-c1ccc(Br)cc1
InChI Key InChIKey=XONZZCVVDBXKTI-UHFFFAOYSA-N
Data  1 IC50
  Tab Delimited (TSV)   2D SDfile   Computed 3D by Vconf -m prep SDfile
Find this compound or compounds like it in BindingDB:
Activity Spreadsheet -- Enzyme Inhibition Constant Data from BindingDB
Found 1 hit for monomerid = 50162857
TargetCathepsin S(Homo sapiens (Human))
Johnson And Johnson Pharmaceutical Research And Development
Curated by ChEMBL
LigandPNGBDBM50162857(1-(1-{3-[3-(4-Bromo-phenyl)-5-methanesulfonyl-4,5,...)
Affinity DataIC50:  50nM. Assay description: Inhibitory concentration against cathepsin S
In DepthDetails ArticlePubMed