BDBM50162858 6-Chloro-1-(1-{3-[5-methanesulfonyl-3-(4-trifluoromethyl-phenyl)-4,5,6,7-tetrahydro-pyrazolo[4,3-c]pyridin-1-yl]-propyl}-piperidin-4-yl)-1,3-dihydro-benzoimidazol-2-one::CHEMBL181160
SMILES CS(=O)(=O)N1CCc2c(C1)c(nn2CCCN1CCC(CC1)n1c2cc(Cl)ccc2[nH]c1=O)-c1ccc(cc1)C(F)(F)F
InChI Key InChIKey=DTHYSTMEINIJIK-UHFFFAOYSA-N
Data  1 IC50
  Tab Delimited (TSV)   2D SDfile   Computed 3D by Vconf -m prep SDfile
Find this compound or compounds like it in BindingDB:
Activity Spreadsheet -- Enzyme Inhibition Constant Data from BindingDB
Found 1 hit for monomerid = 50162858
TargetCathepsin S(Homo sapiens (Human))
Johnson And Johnson Pharmaceutical Research And Development
Curated by ChEMBL
LigandPNGBDBM50162858(6-Chloro-1-(1-{3-[5-methanesulfonyl-3-(4-trifluoro...)
Affinity DataIC50:  30nM. Assay description: Inhibitory concentration against cathepsin S
In DepthDetails ArticlePubMed