BDBM50163035 5-Chloro-3-methyl-benzo[b]thiophene-2-sulfonic acid [3-(2-dimethylamino-ethyl)-1H-indol-5-yl]-amide::CHEMBL368209
SMILES CN(C)CCc1c[nH]c2ccc(NS(=O)(=O)c3sc4ccc(Cl)cc4c3C)cc12
InChI Key InChIKey=ZHONXOSWPFCSGQ-UHFFFAOYSA-N
Data  1 KI
  Tab Delimited (TSV)   2D SDfile   Computed 3D by Vconf -m prep SDfile
Find this compound or compounds like it in BindingDB:
Activity Spreadsheet -- Enzyme Inhibition Constant Data from BindingDB
Found 1 hit for monomerid = 50163035
Target5-hydroxytryptamine receptor 6(Homo sapiens (Human))
Laboratorios Dr. Esteve
Curated by ChEMBL
LigandPNGBDBM50163035(5-Chloro-3-methyl-benzo[b]thiophene-2-sulfonic aci...)
Affinity DataKi:  0.100nM. Assay description: Inhibition of [3H]-LSD binding to human 5-hydroxytryptamine 6 receptor expressed in HEK293 cells
In DepthDetails ArticlePubMed