BDBM50163051 CHEMBL3793336
SMILES OC(=O)COc1ccc(CCN(C(=O)c2ccccc2)c2ccc(Cl)cc2)cc1
InChI Key InChIKey=RXWMWVXXTSPHTJ-UHFFFAOYSA-N
Data  1 IC50
  Tab Delimited (TSV)   2D SDfile   Computed 3D by Vconf -m prep SDfile
Find this compound or compounds like it in BindingDB:
Activity Spreadsheet -- Enzyme Inhibition Constant Data from BindingDB
Found 1 hit for monomerid = 50163051
TargetProstacyclin receptor(Homo sapiens (Human))
Toray Industries
Curated by ChEMBL
LigandPNGBDBM50163051(CHEMBL3793336)
Affinity DataIC50:  740nM. Assay description: Agonist activity at human IP receptor in platelet rich plasma assessed as inhibition of ADP-induced platelet aggregation preincubated for 1 min follo...
In DepthDetails ArticlePubMed