BDBM50163143 CHEMBL405282::H-Tyr-Val-Met-Gly-His-Phe-Arg-D-Trp-Asp-Arg-Phe-Gly-OH
SMILES CSCC[C@H](NC(=O)[C@@H](NC(=O)[C@@H](N)Cc1ccc(O)cc1)C(C)C)C(=O)NCC(=O)N[C@@H](Cc1cnc[nH]1)C(=O)N[C@@H](Cc1ccccc1)C(=O)N[C@@H](CCCNC(N)=N)C(=O)N[C@H](Cc1c[nH]c2ccccc12)C(=O)N[C@@H](CC(O)=O)C(=O)N[C@@H](CCCNC(N)=N)C(=O)N[C@@H](Cc1ccccc1)C(=O)NCC(O)=O
InChI Key InChIKey=GZWUQPQBOGLSIM-MDMVXOTPSA-N
Data  3 IC50  3 EC50
  Tab Delimited (TSV)   2D SDfile   Computed 3D by Vconf -m prep SDfile
Find this compound or compounds like it in BindingDB:
Activity Spreadsheet -- Enzyme Inhibition Constant Data from BindingDB
Found 6 hits for monomerid = 50163143
TargetMelanocortin receptor 3(Homo sapiens (Human))
University Of Arizona
Curated by ChEMBL
LigandPNGBDBM50163143(CHEMBL405282 | H-Tyr-Val-Met-Gly-His-Phe-Arg-D-Trp...)
Affinity DataEC50:  0.330nM. Assay description: Effective concentration for intracellular cAMP accumulation in human melanocortin 3 receptor expressing HEK 293 cells; (N = 4)
In DepthDetails ArticlePubMed
TargetMelanocortin receptor 3(Homo sapiens (Human))
University Of Arizona
Curated by ChEMBL
LigandPNGBDBM50163143(CHEMBL405282 | H-Tyr-Val-Met-Gly-His-Phe-Arg-D-Trp...)
Affinity DataIC50:  6.70nM. Assay description: Inhibition of [125I]NDP-MSH binding to Melanocortin 3 receptor expressed in HEK293 cells; (N = 4)
In DepthDetails ArticlePubMed
TargetMelanocortin receptor 5(Homo sapiens (Human))
University Of Arizona
Curated by ChEMBL
LigandPNGBDBM50163143(CHEMBL405282 | H-Tyr-Val-Met-Gly-His-Phe-Arg-D-Trp...)
Affinity DataEC50:  82nM. Assay description: Effective concentration for intracellular cAMP accumulation in human melanocortin 5 receptor expressing HEK 293 cells; (N = 4)
In DepthDetails ArticlePubMed
TargetMelanocortin receptor 5(Homo sapiens (Human))
University Of Arizona
Curated by ChEMBL
LigandPNGBDBM50163143(CHEMBL405282 | H-Tyr-Val-Met-Gly-His-Phe-Arg-D-Trp...)
Affinity DataIC50:  340nM. Assay description: Inhibition of [125I]NDP-MSH binding to Melanocortin 5 receptor expressed in HEK293 cells; N = 4
In DepthDetails ArticlePubMed
TargetMelanocortin receptor 4(Homo sapiens (Human))
University Of Arizona
Curated by ChEMBL
LigandPNGBDBM50163143(CHEMBL405282 | H-Tyr-Val-Met-Gly-His-Phe-Arg-D-Trp...)
Affinity DataIC50:  600nM. Assay description: Inhibition of [125I]NDP-MSH binding to Melanocortin 4 receptor expressed in HEK293 cells; (N = 4)
In DepthDetails ArticlePubMed
TargetMelanocortin receptor 4(Homo sapiens (Human))
University Of Arizona
Curated by ChEMBL
LigandPNGBDBM50163143(CHEMBL405282 | H-Tyr-Val-Met-Gly-His-Phe-Arg-D-Trp...)
Affinity DataEC50:  100nM. Assay description: Effective concentration for intracellular cAMP accumulation in human melanocortin 4 receptor expressing HEK 293 cells; (N = 4)
In DepthDetails ArticlePubMed