BDBM50163261 2-[4-(4-Carbamoyl-phenoxy)-phenyl]-1H-benzoimidazole-5-carboxylic acid amide::CHEMBL362677
SMILES NC(=O)c1ccc(Oc2ccc(cc2)-c2nc3ccc(cc3[nH]2)C(N)=O)cc1
InChI Key InChIKey=QBSNOPIUTLWCHX-UHFFFAOYSA-N
Data  1 IC50
  Tab Delimited (TSV)   2D SDfile   Computed 3D by Vconf -m prep SDfile
Find this compound or compounds like it in BindingDB:
Activity Spreadsheet -- Enzyme Inhibition Constant Data from BindingDB
Found 1 hit for monomerid = 50163261
TargetSerine/threonine-protein kinase Chk2(Homo sapiens (Human))
Johnson & Johnson Pharmaceutical Research And Development
Curated by ChEMBL
LigandPNGBDBM50163261(2-[4-(4-Carbamoyl-phenoxy)-phenyl]-1H-benzoimidazo...)
Affinity DataIC50:  47nM. Assay description: Inhibition of recombinant human Chk2 kinase
In DepthDetails ArticlePubMed