BDBM50163323 CHEMBL3794031
SMILES COc1ccc(CN2CCN(C\C=C\CN3C(=O)c4ccccc4C3=O)CC2)cc1
InChI Key InChIKey=VMKZAQUMNOBUNX-SNAWJCMRSA-N
Data  1 IC50
  Tab Delimited (TSV)   2D SDfile   Computed 3D by Vconf -m prep SDfile
Find this compound or compounds like it in BindingDB:
Activity Spreadsheet -- Enzyme Inhibition Constant Data from BindingDB
Found 1 hit for monomerid = 50163323
TargetAcetylcholinesterase(Electrophorus electricus (Electric eel))
Chinese Academy Of Agricultural Sciences
Curated by ChEMBL
LigandPNGBDBM50163323(CHEMBL3794031)
Affinity DataIC50:  489nM. Assay description: Inhibition of electric eel AChE preincubated for 15 mins followed by addition of acetylthiocholine iodide substrate by Ellman's method-based spectrop...
In DepthDetails ArticlePubMed