BDBM50163337 CHEMBL3792561
SMILES Clc1ccc(CN2CCN(CCCCCCCCN3C(=O)c4ccccc4C3=O)CC2)cc1
InChI Key InChIKey=HWUYFOYLBMNOMZ-UHFFFAOYSA-N
Data  1 IC50
  Tab Delimited (TSV)   2D SDfile   Computed 3D by Vconf -m prep SDfile
Find this compound or compounds like it in BindingDB:
Activity Spreadsheet -- Enzyme Inhibition Constant Data from BindingDB
Found 1 hit for monomerid = 50163337
TargetAcetylcholinesterase(Electrophorus electricus (Electric eel))
Chinese Academy Of Agricultural Sciences
Curated by ChEMBL
LigandPNGBDBM50163337(CHEMBL3792561)
Affinity DataIC50:  440nM. Assay description: Inhibition of electric eel AChE preincubated for 15 mins followed by addition of acetylthiocholine iodide substrate by Ellman's method-based spectrop...
In DepthDetails ArticlePubMed