BDBM50163442 (2R,3R,4S,5S)-2-Hydroxymethyl-piperidine-3,4,5-triol::CHEMBL176206
SMILES OC[C@H]1NC[C@H](O)[C@H](O)[C@@H]1O
InChI Key InChIKey=LXBIFEVIBLOUGU-MOJAZDJTSA-N
Data  1 IC50
  Tab Delimited (TSV)   2D SDfile   Computed 3D by Vconf -m prep SDfile
Find this compound or compounds like it in BindingDB:
Activity Spreadsheet -- Enzyme Inhibition Constant Data from BindingDB
Found 1 hit for monomerid = 50163442
TargetTissue alpha-L-fucosidase(Homo sapiens (Human))
Toyama Medical And Pharmaceutical University
Curated by ChEMBL
LigandPNGBDBM50163442((2R,3R,4S,5S)-2-Hydroxymethyl-piperidine-3,4,5-tri...)
Affinity DataIC50:  1.94E+5nM. Assay description: Inhibitory concentration against human alpha-fucosidase
In DepthDetails ArticlePubMed