BDBM50163618 (3-Ethyl-2-thiophen-3-yl-quinolin-6-yl)-(4-methoxy-cyclohexyl)-methanone::CHEMBL359883
SMILES CCc1cc2cc(ccc2nc1-c1ccsc1)C(=O)C1CCC(CC1)OC
InChI Key InChIKey=KPQFFGITPXRODU-UHFFFAOYSA-N
Data  1 IC50
  Tab Delimited (TSV)   2D SDfile   Computed 3D by Vconf -m prep SDfile
Find this compound or compounds like it in BindingDB:
Activity Spreadsheet -- Enzyme Inhibition Constant Data from BindingDB
Found 1 hit for monomerid = 50163618
TargetMetabotropic glutamate receptor 1(Homo sapiens (Human))
Janssen-Cilag
Curated by ChEMBL
LigandPNGBDBM50163618((3-Ethyl-2-thiophen-3-yl-quinolin-6-yl)-(4-methoxy...)
Affinity DataIC50:  191nM. Assay description: Inhibitory concentration against human metabotropic glutamate receptor
In DepthDetails ArticlePubMed