BDBM50163704 CHEMBL3793863
SMILES [H][C@@]12C[C@@]([H])(C1(C)C)[C@]1(C)OB(OC1C2)[C@H](Cc1ccc(C)cc1)NC(=O)[C@H](Cc1ccccc1)NC(C)=O
InChI Key InChIKey=IVJQBZDNBUPZOQ-DHOOOEQLSA-N
Data  2 IC50
  Tab Delimited (TSV)   2D SDfile   Computed 3D by Vconf -m prep SDfile
Find this compound or compounds like it in BindingDB:
Activity Spreadsheet -- Enzyme Inhibition Constant Data from BindingDB
Found 2 hits for monomerid = 50163704
TargetProteasome subunit beta type-5(Homo sapiens (Human))
Nanjing Forestry University
Curated by ChEMBL
LigandPNGBDBM50163704(CHEMBL3793863)
Affinity DataIC50:  2.73nM. Assay description: Inhibition of chymotrypsin like activity of human 20S proteasome using Suc-Leu-Leu-Val-Tyr-AMC as substrate preincubated for 10 mins followed by subs...
In DepthDetails ArticlePubMed
TargetProteasome subunit beta type-5(Homo sapiens (Human))
Nanjing Forestry University
Curated by ChEMBL
LigandPNGBDBM50163704(CHEMBL3793863)
Affinity DataIC50:  2.70nM. Assay description: Inhibition of chymotrypsin like activity of human 20S proteasome using Suc-Leu-Leu-Val-Tyr-AMC as substrate preincubated for 10 mins followed by subs...
In DepthDetails ArticlePubMed