BDBM50163761 CHEMBL3798778
SMILES COCCN1CCCC11CCN(CC1)c1c(Cl)cncc1-c1ccc2N(C)S(=O)(=O)Cc2c1
InChI Key InChIKey=GRKOQLWARQVTPO-UHFFFAOYSA-N
Data  1 IC50
PDB links: 1 PDB ID matches this monomer.
  Tab Delimited (TSV)   2D SDfile   Computed 3D by Vconf -m prep SDfile
Find this compound or compounds like it in BindingDB:
Activity Spreadsheet -- Enzyme Inhibition Constant Data from BindingDB
Found 1 hit for monomerid = 50163761
TargetCyclin-dependent kinase 8(Homo sapiens (Human))
The Institute Of Cancer Research
Curated by ChEMBL
LigandPNGBDBM50163761(CHEMBL3798778)
Affinity DataIC50:  49nM. Assay description: Binding affinity to His-tagged CDK8 (unknown origin) after 60 mins by FRET based lanthascreen binding assay