BDBM50163872 CHEMBL3797208
SMILES [H][C@]12C[C@]1([C@@H](O)[C@@H](O)[C@@H]2n1cnc2c(\C=C(/O)c3ccccc3Cl)nc(nc12)C#Cc1ccccc1Cl)C(=O)NC
InChI Key InChIKey=WOGDRZQTOWGUDU-RABDIBLPSA-N
Data  1 KI
  Tab Delimited (TSV)   2D SDfile   Computed 3D by Vconf -m prep SDfile
Find this compound or compounds like it in BindingDB:
Activity Spreadsheet -- Enzyme Inhibition Constant Data from BindingDB
Found 1 hit for monomerid = 50163872
TargetTransmembrane domain-containing protein TMIGD3(Homo sapiens (Human))
National Institute Of Diabetes And Digestive And Kidney Diseases
Curated by ChEMBL
LigandPNGBDBM50163872(CHEMBL3797208)
Affinity DataKi:  515nM. Assay description: Agonist activity at recombinant human adenosine A3 receptor expressed in CHO cells assessed as inhibition of forskolin-stimulated cAMP accumulation p...
In DepthDetails ArticlePubMed