BDBM50164380 CHEMBL3799878
SMILES Cc1sc2nc(Cn3nc(cc3Cl)C(F)(F)F)cc(=O)n2c1[C@@H]1C[C@H]1C#N
InChI Key InChIKey=SQALNDKGODGXJT-WCBMZHEXSA-N
Data  6 EC50
  Tab Delimited (TSV)   2D SDfile   Computed 3D by Vconf -m prep SDfile
Find this compound or compounds like it in BindingDB:
Activity Spreadsheet -- Enzyme Inhibition Constant Data from BindingDB
Found 6 hits for monomerid = 50164380
TargetGlutamate receptor 2(Homo sapiens (Human))
Pharmaron-Beijing
Curated by ChEMBL
LigandPNGBDBM50164380(CHEMBL3799878)
Affinity DataEC50:  702nM. Assay description: Positive allosteric modulation of human GluA2 AMPAR flip isomer expressed in Dox-inducible cells measured every 5 mins by BD calcium indicator dye ba...
In DepthDetails ArticlePubMed
TargetGlutamate receptor ionotropic, NMDA 1/2A(Homo sapiens (Human))
Pharmaron-Beijing
Curated by ChEMBL
LigandPNGBDBM50164380(CHEMBL3799878)
Affinity DataEC50:  30nM. Assay description: Positive allosteric modulation of GluN1/GluN2A NMDAR (unknown origin) expressed in Dox-inducible cells measured every 5 mins by BD calcium indicator ...
In DepthDetails ArticlePubMed
TargetGlutamate receptor 2(Homo sapiens (Human))
Pharmaron-Beijing
Curated by ChEMBL
LigandPNGBDBM50164380(CHEMBL3799878)
Affinity DataEC50:  73nM. Assay description: Positive allosteric modulation of human GluA2 receptor flop isoform assessed as increase in glutamate-induced calcium flux measured at time interval ...
In DepthDetails ArticlePubMed
TargetGlutamate receptor 2(Homo sapiens (Human))
Pharmaron-Beijing
Curated by ChEMBL
LigandPNGBDBM50164380(CHEMBL3799878)
Affinity DataEC50:  700nM. Assay description: Positive allosteric modulation of human GluA2 receptor flip isoform assessed as increase in glutamate-induced calcium flux measured at time interval ...
In DepthDetails ArticlePubMed
TargetGlutamate receptor ionotropic, NMDA 1/2A(Homo sapiens (Human))
Pharmaron-Beijing
Curated by ChEMBL
LigandPNGBDBM50164380(CHEMBL3799878)
Affinity DataEC50:  30nM. Assay description: Positive allosteric modulation of GluN1/GluN2A receptor (unknown origin) expressed in CHO cells assessed as increase in glutamate-induced calcium flu...
In DepthDetails ArticlePubMed
TargetGlutamate receptor 2(Homo sapiens (Human))
Pharmaron-Beijing
Curated by ChEMBL
LigandPNGBDBM50164380(CHEMBL3799878)
Affinity DataEC50:  73nM. Assay description: Positive allosteric modulation of human GluA2 AMPAR flop isomer expressed in Dox-inducible cells measured every 5 mins by BD calcium indicator dye ba...
In DepthDetails ArticlePubMed