BDBM50164522 CHEMBL3797442
SMILES COc1ccc(cc1NC(=O)c1ccc(Cl)cc1Cl)C(=O)NO
InChI Key InChIKey=DSWXYOCCSDFQSQ-UHFFFAOYSA-N
Data  5 IC50
PDB links: 1 PDB ID matches this monomer.
  Tab Delimited (TSV)   2D SDfile   Computed 3D by Vconf -m prep SDfile
Find this compound or compounds like it in BindingDB:
Activity Spreadsheet -- Enzyme Inhibition Constant Data from BindingDB
Found 5 hits for monomerid = 50164522
TargetHistone deacetylase 1(Homo sapiens (Human))
Martin-Luther University Of Halle-Wittenberg
Curated by ChEMBL
LigandPNGBDBM50164522(CHEMBL3797442)
Affinity DataIC50:  1.30E+4nM. Assay description: Inhibition of recombinant human HDAC1 using Cbz-(Ac)Lys-AMC as substrate preincubated for 90 mins followed by trypsin addition measured after 20 mins...
In DepthDetails ArticlePubMed
TargetHistone deacetylase 6(Homo sapiens (Human))
Martin-Luther University Of Halle-Wittenberg
Curated by ChEMBL
LigandPNGBDBM50164522(CHEMBL3797442)
Affinity DataIC50:  2.30E+3nM. Assay description: Inhibition of recombinant human HDAC6 using Cbz-(Ac)Lys-AMC as substrate preincubated for 90 mins followed by trypsin addition measured after 20 mins...
In DepthDetails ArticlePubMed
TargetHistone deacetylase 8(Schistosoma mansoni)
Washington University
Curated by ChEMBL
LigandPNGBDBM50164522(CHEMBL3797442)
Affinity DataIC50:  120nM. Assay description: Inhibition of Schistosoma mansoni KDAC8 using (FAM)-labeled peptide as substrate after 60 mins by microfluidic assay
TargetHistone deacetylase 8(Schistosoma mansoni)
Washington University
Curated by ChEMBL
LigandPNGBDBM50164522(CHEMBL3797442)
Affinity DataIC50:  122nM. Assay description: Inhibition of recombinant Schistosoma mansoni HDAC8 expressed in Escherichia coli using Fluor de Lys as substrate preincubated for 90 mins followed b...
TargetHistone deacetylase 8(Homo sapiens (Human))
Martin-Luther University Of Halle-Wittenberg
Curated by ChEMBL
LigandPNGBDBM50164522(CHEMBL3797442)
Affinity DataIC50:  548nM. Assay description: Inhibition of recombinant human HDAC8 using Fluor de Lys as substrate preincubated for 90 mins followed by BML-KI176 addition measured after 45 mins ...
In DepthDetails ArticlePubMed