BDBM50164642 2',3'-Dideoxynucleoside5'-alpha-P-Borano-beta,gamma-(difluoromethylene)triphosphates derivative::CHEMBL366239
SMILES [BH3-]P(=O)(OCC1CCC(O1)n1ccc(N)nc1=O)OP([O-])(=O)C(F)(F)P([O-])([O-])=O
InChI Key InChIKey=BBYQREGATALQIZ-UHFFFAOYSA-K
Data  1 KI
  Tab Delimited (TSV)   2D SDfile   Computed 3D by Vconf -m prep SDfile
Find this compound or compounds like it in BindingDB:
Activity Spreadsheet -- Enzyme Inhibition Constant Data from BindingDB
Found 1 hit for monomerid = 50164642
TargetReverse transcriptase/RNaseH(Human immunodeficiency virus 1)
Biota
Curated by ChEMBL
LigandPNGBDBM50164642(2',3'-Dideoxynucleoside5'-alpha-P-Borano-beta,gamm...)
Affinity DataKi:  23nM. Assay description: Inhibitory constant against HIV-1 reverse transcriptase
In DepthDetails ArticlePubMed