BDBM50164900 CHEMBL194291::N-((2R,3R)-2-Pyridin-3-ylmethyl-1-aza-bicyclo[2.2.2]oct-3-yl)-benzamide
SMILES O=C(N[C@@H]1C2CCN(CC2)[C@@H]1Cc1cccnc1)c1ccccc1
InChI Key InChIKey=AGUPFDFSGDERMK-RTBURBONSA-N
Data  2 KI
  Tab Delimited (TSV)   2D SDfile   Computed 3D by Vconf -m prep SDfile
Find this compound or compounds like it in BindingDB:
Activity Spreadsheet -- Enzyme Inhibition Constant Data from BindingDB
Found 2 hits for monomerid = 50164900
TargetNeuronal acetylcholine receptor subunit alpha-7(Rattus norvegicus (Rat))
Targacept
Curated by ChEMBL
LigandPNGBDBM50164900(CHEMBL194291 | N-((2R,3R)-2-Pyridin-3-ylmethyl-1-a...)
Affinity DataKi:  52nM. Assay description: Inhibitory constant against [3H]methyllycaconitine binding towards Nicotinic acetylcholine receptor alpha-7 of rat brain hippocampus
In DepthDetails ArticlePubMed
TargetNeuronal acetylcholine receptor subunit alpha-4/beta-2(Homo sapiens (Human))
Targacept
Curated by ChEMBL
LigandPNGBDBM50164900(CHEMBL194291 | N-((2R,3R)-2-Pyridin-3-ylmethyl-1-a...)
Affinity DataKi: >1.00E+4nM. Assay description: Binding affinity towards Nicotinic acetylcholine receptor alpha4-beta2; Not significant
In DepthDetails ArticlePubMed