BDBM50164978 (R)-2-(3-Phenylsulfanyl-benzoyl)-1,2,3,4-tetrahydro-isoquinoline-3-carboxylic acid (4-chloro-phenyl)-amide::CHEMBL370945
SMILES Clc1ccc(NC(=O)[C@H]2Cc3ccccc3CN2C(=O)c2cccc(Sc3ccccc3)c2)cc1
InChI Key InChIKey=PFWXEVUUBWAJRV-HHHXNRCGSA-N
Data  1 EC50
  Tab Delimited (TSV)   2D SDfile   Computed 3D by Vconf -m prep SDfile
Find this compound or compounds like it in BindingDB:
Activity Spreadsheet -- Enzyme Inhibition Constant Data from BindingDB
Found 1 hit for monomerid = 50164978
TargetCystic fibrosis transmembrane conductance regulator(Homo sapiens (Human))
Genzyme
Curated by ChEMBL
LigandPNGBDBM50164978((R)-2-(3-Phenylsulfanyl-benzoyl)-1,2,3,4-tetrahydr...)
Affinity DataEC50:  394nM. Assay description: Effective concentration for cellular chloride transport in C127 mouse epithelial cell transfected with recombinant Delta F508 CFTR
In DepthDetails ArticlePubMed