BDBM50164985 (S)-2-(3-Ethoxy-benzoyl)-1,2,3,4-tetrahydro-isoquinoline-3-carboxylic acid (4-pentyl-phenyl)-amide::CHEMBL195793
SMILES CCCCCc1ccc(NC(=O)[C@@H]2Cc3ccccc3CN2C(=O)c2cccc(OCC)c2)cc1
InChI Key InChIKey=AHKVITFPGPOGSJ-NDEPHWFRSA-N
Data  1 EC50
  Tab Delimited (TSV)   2D SDfile   Computed 3D by Vconf -m prep SDfile
Find this compound or compounds like it in BindingDB:
Activity Spreadsheet -- Enzyme Inhibition Constant Data from BindingDB
Found 1 hit for monomerid = 50164985
TargetCystic fibrosis transmembrane conductance regulator(Homo sapiens (Human))
Genzyme
Curated by ChEMBL
LigandPNGBDBM50164985((S)-2-(3-Ethoxy-benzoyl)-1,2,3,4-tetrahydro-isoqui...)
Affinity DataEC50:  26nM. Assay description: Effective concentration for cellular chloride transport in C127 mouse epithelial cell transfected with recombinant Delta F508 CFTR
In DepthDetails ArticlePubMed