BDBM50165267 8-(2,6-Dichloro-3,4,5-trimethoxy-phenylsulfanyl)-9-(2-isopropoxy-ethyl)-9H-purin-6-ylamine::CHEMBL370247
SMILES COc1c(Cl)c(Sc2nc3c(N)ncnc3n2CCOC(C)C)c(Cl)c(OC)c1OC
InChI Key InChIKey=KGYLZYXUJOJRJI-UHFFFAOYSA-N
Data  1 IC50  1 EC50
  Tab Delimited (TSV)   2D SDfile   Computed 3D by Vconf -m prep SDfile
Find this compound or compounds like it in BindingDB:
Activity Spreadsheet -- Enzyme Inhibition Constant Data from BindingDB
Found 2 hits for monomerid = 50165267
TargetHeat shock protein HSP 90-alpha/90-beta(Homo sapiens (Human))
Memorial Sloan-Kettering Cancer Center
Curated by ChEMBL
LigandPNGBDBM50165267(8-(2,6-Dichloro-3,4,5-trimethoxy-phenylsulfanyl)-9...)
Affinity DataIC50:  1.38E+4nM. Assay description: Inhibition of Hsp90 protein as degradation of HER2 kinase in SKBr3 cells
In DepthDetails ArticlePubMed
TargetHeat shock protein HSP 90-alpha(Mus musculus)
Memorial Sloan-Kettering Cancer Center
Curated by ChEMBL
LigandPNGBDBM50165267(8-(2,6-Dichloro-3,4,5-trimethoxy-phenylsulfanyl)-9...)
Affinity DataEC50:  2.10E+3nM. Assay description: Displacement of 5 nM GM-BODIPY from mouse heat shock protein HSP90-alpha
In DepthDetails ArticlePubMed