BDBM50165318 9-Butyl-8-(3,4,5-trimethoxy-phenylsulfanyl)-9H-purin-6-ylamine::CHEMBL191641
SMILES CCCCn1c(Sc2cc(OC)c(OC)c(OC)c2)nc2c(N)ncnc12
InChI Key InChIKey=YCFUHBMPNXZIFR-UHFFFAOYSA-N
Data  1 IC50  1 EC50
  Tab Delimited (TSV)   2D SDfile   Computed 3D by Vconf -m prep SDfile
Find this compound or compounds like it in BindingDB:
Activity Spreadsheet -- Enzyme Inhibition Constant Data from BindingDB
Found 2 hits for monomerid = 50165318
TargetHeat shock protein HSP 90-alpha(Mus musculus)
Memorial Sloan-Kettering Cancer Center
Curated by ChEMBL
LigandPNGBDBM50165318(9-Butyl-8-(3,4,5-trimethoxy-phenylsulfanyl)-9H-pur...)
Affinity DataEC50:  3.10E+3nM. Assay description: Displacement of 5 nM GM-BODIPY from mouse heat shock protein HSP90-alpha
In DepthDetails ArticlePubMed
TargetHeat shock protein HSP 90-alpha/90-beta(Homo sapiens (Human))
Memorial Sloan-Kettering Cancer Center
Curated by ChEMBL
LigandPNGBDBM50165318(9-Butyl-8-(3,4,5-trimethoxy-phenylsulfanyl)-9H-pur...)
Affinity DataIC50:  8.85E+4nM. Assay description: Inhibition of Hsp90 protein as degradation of HER2 kinase in SKBr3 cells
In DepthDetails ArticlePubMed