BDBM50165463 CHEMBL3799441
SMILES CCCN(C)Cc1sc(cc1CC)-c1nc(no1)-c1cc(C)c(OC[C@@H](O)CNC(=O)CO)c(CC)c1
InChI Key InChIKey=YXJLBZSOQPOXSH-NRFANRHFSA-N
Data  2 EC50
  Tab Delimited (TSV)   2D SDfile   Computed 3D by Vconf -m prep SDfile
Find this compound or compounds like it in BindingDB:
Activity Spreadsheet -- Enzyme Inhibition Constant Data from BindingDB
Found 2 hits for monomerid = 50165463
TargetSphingosine 1-phosphate receptor 3(Homo sapiens (Human))
Actelion Pharmaceuticals
Curated by ChEMBL
LigandPNGBDBM50165463(CHEMBL3799441)
Affinity DataEC50:  20nM. Assay description: Agonist activity at human recombinant S1PR3 expressed in CHO cell membranes assessed as [35S]GTPgammaS binding preincubated for 30 mins followed by [...
In DepthDetails ArticlePubMed
TargetSphingosine 1-phosphate receptor 1(Homo sapiens (Human))
Actelion Pharmaceuticals
Curated by ChEMBL
LigandPNGBDBM50165463(CHEMBL3799441)
Affinity DataEC50:  0.5nM. Assay description: Agonist activity at human recombinant S1PR1 expressed in CHO cell membranes assessed as [35S]GTPgammaS binding preincubated for 30 mins followed by [...
In DepthDetails ArticlePubMed