BDBM50165572 CHEMBL3800559
SMILES COc1cccc(c1)-c1cnc2nnc(Cc3ccc4ncccc4c3)n2n1
InChI Key InChIKey=GEIAWGSLQVBVDC-UHFFFAOYSA-N
Data  1 IC50
  Tab Delimited (TSV)   2D SDfile   Computed 3D by Vconf -m prep SDfile
Find this compound or compounds like it in BindingDB:
Activity Spreadsheet -- Enzyme Inhibition Constant Data from BindingDB
Found 1 hit for monomerid = 50165572
TargetHepatocyte growth factor receptor(Homo sapiens (Human))
Chinese Academy Of Sciences (Cas)
Curated by ChEMBL
LigandPNGBDBM50165572(CHEMBL3800559)
Affinity DataIC50:  0.590nM. Assay description: Inhibition of recombinant c-Met (unknown origin) using poly (Glu, Tyr) 4:1 as substrate incubated for 60 mins by ELISA
In DepthDetails ArticlePubMed