BDBM50165962 (S)-2-{2-[4-(4-Carbamimidoyl-benzyl)-3-oxo-3,4-dihydro-2H-benzo[1,4]oxazin-7-ylcarbamoyl]-3-phenyl-propionylamino}-propionic acid ethyl ester; compound with acetic acid::CHEMBL192663
SMILES CCOC(=O)[C@H](C)NC(=O)C(Cc1ccccc1)C(=O)Nc1ccc2N(Cc3ccc(cc3)C(N)=N)C(=O)COc2c1
InChI Key InChIKey=BFNAHZQHOSLNRC-XGLRFROISA-N
Data  1 KI
  Tab Delimited (TSV)   2D SDfile   Computed 3D by Vconf -m prep SDfile
Find this compound or compounds like it in BindingDB:
Activity Spreadsheet -- Enzyme Inhibition Constant Data from BindingDB
Found 1 hit for monomerid = 50165962
TargetIntegrin alpha-IIb/beta-3(Homo sapiens (Human))
University Of Ljubljana
Curated by ChEMBL
LigandPNGBDBM50165962((S)-2-{2-[4-(4-Carbamimidoyl-benzyl)-3-oxo-3,4-dih...)
Affinity DataKi:  7.30E+3nM. Assay description: Inhibitory activity against binding of Fibrinogen to thrombocyte alpha IIb beta-3 integrin
In DepthDetails ArticlePubMed