BDBM50165998 CHEMBL3800405
SMILES C[C@H]1CNC(=O)c2c(SCC3CC3)sc(-c3cc[nH]n3)c12
InChI Key InChIKey=JQZVEQSNEZKQGU-QMMMGPOBSA-N
Data  2 KI
  Tab Delimited (TSV)   2D SDfile   Computed 3D by Vconf -m prep SDfile
Find this compound or compounds like it in BindingDB:
Activity Spreadsheet -- Enzyme Inhibition Constant Data from BindingDB
Found 2 hits for monomerid = 50165998
TargetLeucine-rich repeat serine/threonine-protein kinase 2(Homo sapiens (Human))
Merck Research Laboratories
Curated by ChEMBL
LigandPNGBDBM50165998(CHEMBL3800405)
Affinity DataKi:  34nM. Assay description: Inhibition of human recombinant LRRK2 G2019S mutant using fluorescein- ERM as substrate after 1 hr by TR-FRET assay
In DepthDetails ArticlePubMed
TargetLeucine-rich repeat serine/threonine-protein kinase 2(Homo sapiens (Human))
Merck Research Laboratories
Curated by ChEMBL
LigandPNGBDBM50165998(CHEMBL3800405)
Affinity DataKi:  83nM. Assay description: Inhibition of GST-tagged human recombinant wild type LRRK2 using fluorescein- ERM as substrate after 1 hr by TR-FRET assay
In DepthDetails ArticlePubMed