BDBM50166033 4-((1S,2S,5S,6S,9R)-5-Hydroxymethyl-6,8,9-trimethyl-3-oxa-bicyclo[3.3.1]non-7-en-2-yl)-2-methoxy-phenol::CHEMBL194392
SMILES COc1cc(ccc1O)[C@H]1OC[C@@]2(CO)[C@@H](C)C=C(C)[C@@H]1[C@H]2C
InChI Key InChIKey=JVGXICUTXHMMNN-KFNRRLBXSA-N
Data  1 IC50
  Tab Delimited (TSV)   2D SDfile   Computed 3D by Vconf -m prep SDfile
Find this compound or compounds like it in BindingDB:
Activity Spreadsheet -- Enzyme Inhibition Constant Data from BindingDB
Found 1 hit for monomerid = 50166033
TargetSex hormone-binding globulin(Homo sapiens (Human))
University Of British Columbia
Curated by ChEMBL
LigandPNGBDBM50166033(4-((1S,2S,5S,6S,9R)-5-Hydroxymethyl-6,8,9-trimethy...)
Affinity DataIC50:  2.24E+4nM. Assay description: Inhibitory concentration against [3H]-DHT binding to human sex hormone-binding globulin (SHBG)
In DepthDetails ArticlePubMed